{"text_format":"1","workbook":"xlsx","n_sheets":24,"sheets":["Explications","Accueil","Equipe AvsB","Equipe AvsC","Equipe AvsD","Equipe AvsE","Equipe AvsF","Equipe BvsC","Equipe BvsD","Equipe BvsE","Equipe BvsF","Equipe CvsD","Equipe CvsE","Equipe CvsF","Equipe DvsE","Equipe DvsF","Equipe EvsF","Résultats EA","Résultats EB","Résultats EC","Résultats ED","Résultats EE","Résultats EF","Bilan des Matchs"],"not_rendered":{"charts":30,"images":4,"macros":1,"external_links":1,"defined_names":0,"comments":0,"pivot_tables":0},"unopened":[],"bounds":{"document_bytes":16777216,"sheet_cells":100000,"rows_first":2000,"rows_last":500,"rows_between":2000,"halvings":0,"cell_chars":16384,"cell_head_chars":4096},"cells_cut":0,"cells_raw":0,"read":"whole","date_system":"1900"}

{"sheet":"Explications","index":0,"n_rows":32,"n_cols":27,"rows_kept":32,"cut":false,"hidden":false,"merged":[[31,26,32,26],[30,20,32,21],[31,22,32,22],[31,23,32,23],[31,24,32,24],[31,25,32,25]]}
[]
[]
[]
[]
[]
[]
[]
[]
[]
[]
[]
[]
[]
[]
[]
[]
[]
[]
[]
[]
[]
[]
[]
[]
[]
[]
[]
[]
[]
[]
[null,null,null,null,null,null,null,null,null,null,null,null,null,null,null,null,null,null,null,null,"Point Zones",null,"Zone 1","Zone 2","Zone 3","Zone 4","Enbut"]
[null,null,null,null,null,null,null,null,null,null,null,null,null,null,null,null,null,null,null,null,null,null,1,1,1,1,3]

{"sheet":"Accueil","index":1,"n_rows":0,"n_cols":0,"rows_kept":0,"cut":false,"hidden":false,"merged":[]}

{"sheet":"Equipe AvsB","index":2,"n_rows":23,"n_cols":26,"rows_kept":23,"cut":false,"hidden":false,"merged":[[20,5,22,5],[20,6,22,6],[20,7,22,7],[18,1,18,2],[14,2,14,6],[19,1,19,2],[20,1,20,2],[21,1,21,2],[22,1,22,2],[19,5,19,7],[0,3,0,5],[4,1,4,5],[2,1,2,2],[0,1,0,2],[13,1,13,6],[1,1,1,2],[2,3,2,5],[8,1,10,3],[8,10,10,12],[19,10,19,11],[20,10,20,11],[21,10,21,11],[22,10,22,11],[18,10,18,11]]}
[]
[]
[]
[]
[]
[]
[]
[]
[null,"Equipe A",null,null,null,null,null,null,null,null,"Equipe B"]
[]
[]
[null,null,null,null,null,null,null,null,null,null,null,null,null,null,null,null,null,null,null,null,null,null,"Résultats","V","D","N"]
[null,null,null,null,null,null,null,null,null,null,null,null,null,null,null,null,null,null,null,null,null,null,"A",{"$f":"IF(F21>H21,1,0)","v":0},{"$f":"IF(F21<H21,1,0)","v":0},{"$f":"IF(F21=H21,1,0)","v":1}]
[null,null,null,null,null,null,null,null,null,null,null,null,null,null,null,null,null,null,null,null,null,null,"B",{"$f":"IF(H21>F21,1,0)","v":0},{"$f":"IF(H21<F21,1,0)","v":0},{"$f":"IF(F21=H21,1,0)","v":1}]
[]
[]
[]
[]
[null,"Zone 1",null,null,null,null,null,null,null,null,"Zone 1"]
[null,"Zone 2",null,null,null,"Score",null,null,null,null,"Zone 2"]
[null,"Zone 3",null,null,null,{"$f":"(D19*Explications!W32)+(D20*Explications!X32)+(D21*Explications!Y32)+(D22*Explications!Z32)+(D23*Explications!AA32)","v":0},"VS",{"$f":"(M19*Explications!W32)+(M20*Explications!X32)+(M21*Explications!Y32)+(M22*Explications!Z32)+(M23*Explications!AA32)","v":0},null,null,"Zone 3"]
[null,"Zone 4",null,null,null,null,null,null,null,null,"Zone 4"]
[null,"Point marqué",null,null,null,null,null,null,null,null,"Point marqué"]

{"sheet":"Equipe AvsC","index":3,"n_rows":23,"n_cols":26,"rows_kept":23,"cut":false,"hidden":false,"merged":[[22,1,22,2],[22,10,22,11],[19,1,19,2],[19,5,19,7],[19,10,19,11],[20,1,20,2],[20,5,22,5],[20,6,22,6],[20,7,22,7],[20,10,20,11],[21,1,21,2],[21,10,21,11],[8,1,10,3],[8,10,10,12],[13,1,13,6],[14,2,14,6],[18,1,18,2],[18,10,18,11],[4,1,4,5],[0,1,0,2],[0,3,0,5],[1,1,1,2],[2,1,2,2],[2,3,2,5]]}
[]
[]
[]
[]
[]
[]
[]
[]
[null,"Equipe A",null,null,null,null,null,null,null,null,"Equipe C"]
[]
[]
[null,null,null,null,null,null,null,null,null,null,null,null,null,null,null,null,null,null,null,null,null,null,"Résultats","V","D","N"]
[null,null,null,null,null,null,null,null,null,null,null,null,null,null,null,null,null,null,null,null,null,null,"A",{"$f":"IF(F21>H21,1,0)","v":0},{"$f":"IF(F21<H21,1,0)","v":0},{"$f":"IF(F21=H21,1,0)","v":1}]
[null,null,null,null,null,null,null,null,null,null,null,null,null,null,null,null,null,null,null,null,null,null,"c",{"$f":"IF(H21>F21,1,0)","v":0},{"$f":"IF(H21<F21,1,0)","v":0},{"$f":"IF(F21=H21,1,0)","v":1}]
[]
[]
[]
[]
[null,"Zone 1",null,null,null,null,null,null,null,null,"Zone 1"]
[null,"Zone 2",null,null,null,"Score",null,null,null,null,"Zone 2"]
[null,"Zone 3",null,null,null,{"$f":"(D19*Explications!W32)+(D20*Explications!X32)+(D21*Explications!Y32)+(D22*Explications!Z32)+(D23*Explications!AA32)","v":0},"VS",{"$f":"(M19*Explications!W32)+(M20*Explications!X32)+(M21*Explications!Y32)+(M22*Explications!Z32)+(M23*Explications!AA32)","v":0},null,null,"Zone 3"]
[null,"Zone 4",null,null,null,null,null,null,null,null,"Zone 4"]
[null,"Point marqué",null,null,null,null,null,null,null,null,"Point marqué"]

{"sheet":"Equipe AvsD","index":4,"n_rows":23,"n_cols":26,"rows_kept":23,"cut":false,"hidden":false,"merged":[[22,1,22,2],[22,10,22,11],[19,1,19,2],[19,5,19,7],[19,10,19,11],[20,1,20,2],[20,5,22,5],[20,6,22,6],[20,7,22,7],[20,10,20,11],[21,1,21,2],[21,10,21,11],[8,1,10,3],[8,10,10,12],[13,1,13,6],[14,2,14,6],[18,1,18,2],[18,10,18,11],[4,1,4,5],[0,1,0,2],[0,3,0,5],[1,1,1,2],[2,1,2,2],[2,3,2,5]]}
[]
[]
[]
[]
[]
[]
[]
[]
[null,"Equipe A",null,null,null,null,null,null,null,null,"Equipe D"]
[]
[]
[null,null,null,null,null,null,null,null,null,null,null,null,null,null,null,null,null,null,null,null,null,null,"Résultats","V","D","N"]
[null,null,null,null,null,null,null,null,null,null,null,null,null,null,null,null,null,null,null,null,null,null,"A",{"$f":"IF(F21>H21,1,0)","v":0},{"$f":"IF(F21<H21,1,0)","v":0},{"$f":"IF(F21=H21,1,0)","v":1}]
[null,null,null,null,null,null,null,null,null,null,null,null,null,null,null,null,null,null,null,null,null,null,"D",{"$f":"IF(H21>F21,1,0)","v":0},{"$f":"IF(H21<F21,1,0)","v":0},{"$f":"IF(F21=H21,1,0)","v":1}]
[]
[]
[]
[]
[null,"Zone 1",null,null,null,null,null,null,null,null,"Zone 1"]
[null,"Zone 2",null,null,null,"Score",null,null,null,null,"Zone 2"]
[null,"Zone 3",null,null,null,{"$f":"(D19*Explications!W32)+(D20*Explications!X32)+(D21*Explications!Y32)+(D22*Explications!Z32)+(D23*Explications!AA32)","v":0},"VS",{"$f":"(M19*Explications!W32)+(M20*Explications!X32)+(M21*Explications!Y32)+(M22*Explications!Z32)+(M23*Explications!AA32)","v":0},null,null,"Zone 3"]
[null,"Zone 4",null,null,null,null,null,null,null,null,"Zone 4"]
[null,"Point marqué",null,null,null,null,null,null,null,null,"Point marqué"]

{"sheet":"Equipe AvsE","index":5,"n_rows":23,"n_cols":26,"rows_kept":23,"cut":false,"hidden":false,"merged":[[22,1,22,2],[22,10,22,11],[19,1,19,2],[19,5,19,7],[19,10,19,11],[20,1,20,2],[20,5,22,5],[20,6,22,6],[20,7,22,7],[20,10,20,11],[21,1,21,2],[21,10,21,11],[8,1,10,3],[8,10,10,12],[13,1,13,6],[14,2,14,6],[18,1,18,2],[18,10,18,11],[4,1,4,5],[0,1,0,2],[0,3,0,5],[1,1,1,2],[2,1,2,2],[2,3,2,5]]}
[]
[]
[]
[]
[]
[]
[]
[]
[null,"Equipe A",null,null,null,null,null,null,null,null,"Equipe E"]
[]
[]
[null,null,null,null,null,null,null,null,null,null,null,null,null,null,null,null,null,null,null,null,null,null,"Résultats","V","D","N"]
[null,null,null,null,null,null,null,null,null,null,null,null,null,null,null,null,null,null,null,null,null,null,"A",{"$f":"IF(F21>H21,1,0)","v":0},{"$f":"IF(F21<H21,1,0)","v":0},{"$f":"IF(F21=H21,1,0)","v":1}]
[null,null,null,null,null,null,null,null,null,null,null,null,null,null,null,null,null,null,null,null,null,null,"E",{"$f":"IF(H21>F21,1,0)","v":0},{"$f":"IF(H21<F21,1,0)","v":0},{"$f":"IF(F21=H21,1,0)","v":1}]
[]
[]
[]
[]
[null,"Zone 1",null,null,null,null,null,null,null,null,"Zone 1"]
[null,"Zone 2",null,null,null,"Score",null,null,null,null,"Zone 2"]
[null,"Zone 3",null,null,null,{"$f":"(D19*Explications!W32)+(D20*Explications!X32)+(D21*Explications!Y32)+(D22*Explications!Z32)+(D23*Explications!AA32)","v":0},"VS",{"$f":"(M19*Explications!W32)+(M20*Explications!X32)+(M21*Explications!Y32)+(M22*Explications!Z32)+(M23*Explications!AA32)","v":0},null,null,"Zone 3"]
[null,"Zone 4",null,null,null,null,null,null,null,null,"Zone 4"]
[null,"Point marqué",null,null,null,null,null,null,null,null,"Point marqué"]

{"sheet":"Equipe AvsF","index":6,"n_rows":23,"n_cols":26,"rows_kept":23,"cut":false,"hidden":false,"merged":[[22,1,22,2],[22,10,22,11],[19,1,19,2],[19,5,19,7],[19,10,19,11],[20,1,20,2],[20,5,22,5],[20,6,22,6],[20,7,22,7],[20,10,20,11],[21,1,21,2],[21,10,21,11],[8,1,10,3],[8,10,10,12],[13,1,13,6],[14,2,14,6],[18,1,18,2],[18,10,18,11],[4,1,4,5],[0,1,0,2],[0,3,0,5],[1,1,1,2],[2,1,2,2],[2,3,2,5]]}
[]
[]
[]
[]
[]
[]
[]
[]
[null,"Equipe A",null,null,null,null,null,null,null,null,"Equipe F"]
[]
[]
[null,null,null,null,null,null,null,null,null,null,null,null,null,null,null,null,null,null,null,null,null,null,"Résultats","V","D","N"]
[null,null,null,null,null,null,null,null,null,null,null,null,null,null,null,null,null,null,null,null,null,null,"A",{"$f":"IF(F21>H21,1,0)","v":0},{"$f":"IF(F21<H21,1,0)","v":0},{"$f":"IF(F21=H21,1,0)","v":1}]
[null,null,null,null,null,null,null,null,null,null,null,null,null,null,null,null,null,null,null,null,null,null,"F",{"$f":"IF(H21>F21,1,0)","v":0},{"$f":"IF(H21<F21,1,0)","v":0},{"$f":"IF(F21=H21,1,0)","v":1}]
[]
[]
[]
[]
[null,"Zone 1",null,null,null,null,null,null,null,null,"Zone 1"]
[null,"Zone 2",null,null,null,"Score",null,null,null,null,"Zone 2"]
[null,"Zone 3",null,null,null,{"$f":"(D19*Explications!W32)+(D20*Explications!X32)+(D21*Explications!Y32)+(D22*Explications!Z32)+(D23*Explications!AA32)","v":0},"VS",{"$f":"(M19*Explications!W32)+(M20*Explications!X32)+(M21*Explications!Y32)+(M22*Explications!Z32)+(M23*Explications!AA32)","v":0},null,null,"Zone 3"]
[null,"Zone 4",null,null,null,null,null,null,null,null,"Zone 4"]
[null,"Point marqué",null,null,null,null,null,null,null,null,"Point marqué"]

{"sheet":"Equipe BvsC","index":7,"n_rows":23,"n_cols":26,"rows_kept":23,"cut":false,"hidden":false,"merged":[[22,1,22,2],[22,10,22,11],[19,1,19,2],[19,5,19,7],[19,10,19,11],[20,1,20,2],[20,5,22,5],[20,6,22,6],[20,7,22,7],[20,10,20,11],[21,1,21,2],[21,10,21,11],[8,1,10,3],[8,10,10,12],[13,1,13,6],[14,2,14,6],[18,1,18,2],[18,10,18,11],[4,1,4,5],[0,1,0,2],[0,3,0,5],[1,1,1,2],[2,1,2,2],[2,3,2,5]]}
[]
[]
[]
[]
[]
[]
[]
[]
[null,"Equipe B",null,null,null,null,null,null,null,null,"Equipe C"]
[]
[]
[null,null,null,null,null,null,null,null,null,null,null,null,null,null,null,null,null,null,null,null,null,null,"Résultats","V","D","N"]
[null,null,null,null,null,null,null,null,null,null,null,null,null,null,null,null,null,null,null,null,null,null,"B",{"$f":"IF(F21>H21,1,0)","v":0},{"$f":"IF(F21<H21,1,0)","v":0},{"$f":"IF(F21=H21,1,0)","v":1}]
[null,null,null,null,null,null,null,null,null,null,null,null,null,null,null,null,null,null,null,null,null,null,"C",{"$f":"IF(H21>F21,1,0)","v":0},{"$f":"IF(H21<F21,1,0)","v":0},{"$f":"IF(F21=H21,1,0)","v":1}]
[]
[]
[]
[]
[null,"Zone 1",null,null,null,null,null,null,null,null,"Zone 1"]
[null,"Zone 2",null,null,null,"Score",null,null,null,null,"Zone 2"]
[null,"Zone 3",null,null,null,{"$f":"(D19*Explications!W32)+(D20*Explications!X32)+(D21*Explications!Y32)+(D22*Explications!Z32)+(D23*Explications!AA32)","v":0},"VS",{"$f":"(M19*Explications!W32)+(M20*Explications!X32)+(M21*Explications!Y32)+(M22*Explications!Z32)+(M23*Explications!AA32)","v":0},null,null,"Zone 3"]
[null,"Zone 4",null,null,null,null,null,null,null,null,"Zone 4"]
[null,"Point marqué",null,null,null,null,null,null,null,null,"Point marqué"]

{"sheet":"Equipe BvsD","index":8,"n_rows":23,"n_cols":26,"rows_kept":23,"cut":false,"hidden":false,"merged":[[22,1,22,2],[22,10,22,11],[19,1,19,2],[19,5,19,7],[19,10,19,11],[20,1,20,2],[20,5,22,5],[20,6,22,6],[20,7,22,7],[20,10,20,11],[21,1,21,2],[21,10,21,11],[8,1,10,3],[8,10,10,12],[13,1,13,6],[14,2,14,6],[18,1,18,2],[18,10,18,11],[4,1,4,5],[0,1,0,2],[0,3,0,5],[1,1,1,2],[2,1,2,2],[2,3,2,5]]}
[]
[]
[]
[]
[]
[]
[]
[]
[null,"Equipe B",null,null,null,null,null,null,null,null,"Equipe D"]
[]
[]
[null,null,null,null,null,null,null,null,null,null,null,null,null,null,null,null,null,null,null,null,null,null,"Résultats","V","D","N"]
[null,null,null,null,null,null,null,null,null,null,null,null,null,null,null,null,null,null,null,null,null,null,"B",{"$f":"IF(F21>H21,1,0)","v":0},{"$f":"IF(F21<H21,1,0)","v":0},{"$f":"IF(F21=H21,1,0)","v":1}]
[null,null,null,null,null,null,null,null,null,null,null,null,null,null,null,null,null,null,null,null,null,null,"D",{"$f":"IF(H21>F21,1,0)","v":0},{"$f":"IF(H21<F21,1,0)","v":0},{"$f":"IF(F21=H21,1,0)","v":1}]
[]
[]
[]
[]
[null,"Zone 1",null,null,null,null,null,null,null,null,"Zone 1"]
[null,"Zone 2",null,null,null,"Score",null,null,null,null,"Zone 2"]
[null,"Zone 3",null,null,null,{"$f":"(D19*Explications!W32)+(D20*Explications!X32)+(D21*Explications!Y32)+(D22*Explications!Z32)+(D23*Explications!AA32)","v":0},"VS",{"$f":"(M19*Explications!W32)+(M20*Explications!X32)+(M21*Explications!Y32)+(M22*Explications!Z32)+(M23*Explications!AA32)","v":0},null,null,"Zone 3"]
[null,"Zone 4",null,null,null,null,null,null,null,null,"Zone 4"]
[null,"Point marqué",null,null,null,null,null,null,null,null,"Point marqué"]

{"sheet":"Equipe BvsE","index":9,"n_rows":23,"n_cols":26,"rows_kept":23,"cut":false,"hidden":false,"merged":[[22,1,22,2],[22,10,22,11],[19,1,19,2],[19,5,19,7],[19,10,19,11],[20,1,20,2],[20,5,22,5],[20,6,22,6],[20,7,22,7],[20,10,20,11],[21,1,21,2],[21,10,21,11],[8,1,10,3],[8,10,10,12],[13,1,13,6],[14,2,14,6],[18,1,18,2],[18,10,18,11],[4,1,4,5],[0,1,0,2],[0,3,0,5],[1,1,1,2],[2,1,2,2],[2,3,2,5]]}
[]
[]
[]
[]
[]
[]
[]
[]
[null,"Equipe B",null,null,null,null,null,null,null,null,"Equipe E"]
[]
[]
[null,null,null,null,null,null,null,null,null,null,null,null,null,null,null,null,null,null,null,null,null,null,"Résultats","V","D","N"]
[null,null,null,null,null,null,null,null,null,null,null,null,null,null,null,null,null,null,null,null,null,null,"B",{"$f":"IF(F21>H21,1,0)","v":0},{"$f":"IF(F21<H21,1,0)","v":0},{"$f":"IF(F21=H21,1,0)","v":1}]
[null,null,null,null,null,null,null,null,null,null,null,null,null,null,null,null,null,null,null,null,null,null,"E",{"$f":"IF(H21>F21,1,0)","v":0},{"$f":"IF(H21<F21,1,0)","v":0},{"$f":"IF(F21=H21,1,0)","v":1}]
[]
[]
[]
[]
[null,"Zone 1",null,null,null,null,null,null,null,null,"Zone 1"]
[null,"Zone 2",null,null,null,"Score",null,null,null,null,"Zone 2"]
[null,"Zone 3",null,null,null,{"$f":"(D19*Explications!W32)+(D20*Explications!X32)+(D21*Explications!Y32)+(D22*Explications!Z32)+(D23*Explications!AA32)","v":0},"VS",{"$f":"(M19*Explications!W32)+(M20*Explications!X32)+(M21*Explications!Y32)+(M22*Explications!Z32)+(M23*Explications!AA32)","v":0},null,null,"Zone 3"]
[null,"Zone 4",null,null,null,null,null,null,null,null,"Zone 4"]
[null,"Point marqué",null,null,null,null,null,null,null,null,"Point marqué"]

{"sheet":"Equipe BvsF","index":10,"n_rows":23,"n_cols":26,"rows_kept":23,"cut":false,"hidden":false,"merged":[[22,1,22,2],[22,10,22,11],[19,1,19,2],[19,5,19,7],[19,10,19,11],[20,1,20,2],[20,5,22,5],[20,6,22,6],[20,7,22,7],[20,10,20,11],[21,1,21,2],[21,10,21,11],[8,1,10,3],[8,10,10,12],[13,1,13,6],[14,2,14,6],[18,1,18,2],[18,10,18,11],[4,1,4,5],[0,1,0,2],[0,3,0,5],[1,1,1,2],[2,1,2,2],[2,3,2,5]]}
[]
[]
[]
[]
[]
[]
[]
[]
[null,"Equipe B",null,null,null,null,null,null,null,null,"Equipe F"]
[]
[]
[null,null,null,null,null,null,null,null,null,null,null,null,null,null,null,null,null,null,null,null,null,null,"Résultats","V","D","N"]
[null,null,null,null,null,null,null,null,null,null,null,null,null,null,null,null,null,null,null,null,null,null,"B",{"$f":"IF(F21>H21,1,0)","v":0},{"$f":"IF(F21<H21,1,0)","v":0},{"$f":"IF(F21=H21,1,0)","v":1}]
[null,null,null,null,null,null,null,null,null,null,null,null,null,null,null,null,null,null,null,null,null,null,"F",{"$f":"IF(H21>F21,1,0)","v":0},{"$f":"IF(H21<F21,1,0)","v":0},{"$f":"IF(F21=H21,1,0)","v":1}]
[]
[]
[]
[]
[null,"Zone 1",null,null,null,null,null,null,null,null,"Zone 1"]
[null,"Zone 2",null,null,null,"Score",null,null,null,null,"Zone 2"]
[null,"Zone 3",null,null,null,{"$f":"(D19*Explications!W32)+(D20*Explications!X32)+(D21*Explications!Y32)+(D22*Explications!Z32)+(D23*Explications!AA32)","v":0},"VS",{"$f":"(M19*Explications!W32)+(M20*Explications!X32)+(M21*Explications!Y32)+(M22*Explications!Z32)+(M23*Explications!AA32)","v":0},null,null,"Zone 3"]
[null,"Zone 4",null,null,null,null,null,null,null,null,"Zone 4"]
[null,"Point marqué",null,null,null,null,null,null,null,null,"Point marqué"]

{"sheet":"Equipe CvsD","index":11,"n_rows":23,"n_cols":26,"rows_kept":23,"cut":false,"hidden":false,"merged":[[22,1,22,2],[22,10,22,11],[19,1,19,2],[19,5,19,7],[19,10,19,11],[20,1,20,2],[20,5,22,5],[20,6,22,6],[20,7,22,7],[20,10,20,11],[21,1,21,2],[21,10,21,11],[8,1,10,3],[8,10,10,12],[13,1,13,6],[14,2,14,6],[18,1,18,2],[18,10,18,11],[4,1,4,5],[0,1,0,2],[0,3,0,5],[1,1,1,2],[2,1,2,2],[2,3,2,5]]}
[]
[]
[]
[]
[]
[]
[]
[]
[null,"Equipe C",null,null,null,null,null,null,null,null,"Equipe D"]
[]
[]
[null,null,null,null,null,null,null,null,null,null,null,null,null,null,null,null,null,null,null,null,null,null,"Résultats","V","D","N"]
[null,null,null,null,null,null,null,null,null,null,null,null,null,null,null,null,null,null,null,null,null,null,"C",{"$f":"IF(F21>H21,1,0)","v":0},{"$f":"IF(F21<H21,1,0)","v":0},{"$f":"IF(F21=H21,1,0)","v":1}]
[null,null,null,null,null,null,null,null,null,null,null,null,null,null,null,null,null,null,null,null,null,null,"D",{"$f":"IF(H21>F21,1,0)","v":0},{"$f":"IF(H21<F21,1,0)","v":0},{"$f":"IF(F21=H21,1,0)","v":1}]
[]
[]
[]
[]
[null,"Zone 1",null,null,null,null,null,null,null,null,"Zone 1"]
[null,"Zone 2",null,null,null,"Score",null,null,null,null,"Zone 2"]
[null,"Zone 3",null,null,null,{"$f":"(D19*Explications!W32)+(D20*Explications!X32)+(D21*Explications!Y32)+(D22*Explications!Z32)+(D23*Explications!AA32)","v":0},"VS",{"$f":"(M19*Explications!W32)+(M20*Explications!X32)+(M21*Explications!Y32)+(M22*Explications!Z32)+(M23*Explications!AA32)","v":0},null,null,"Zone 3"]
[null,"Zone 4",null,null,null,null,null,null,null,null,"Zone 4"]
[null,"Point marqué",null,null,null,null,null,null,null,null,"Point marqué"]

{"sheet":"Equipe CvsE","index":12,"n_rows":23,"n_cols":26,"rows_kept":23,"cut":false,"hidden":false,"merged":[[22,1,22,2],[22,10,22,11],[19,1,19,2],[19,5,19,7],[19,10,19,11],[20,1,20,2],[20,5,22,5],[20,6,22,6],[20,7,22,7],[20,10,20,11],[21,1,21,2],[21,10,21,11],[8,1,10,3],[8,10,10,12],[13,1,13,6],[14,2,14,6],[18,1,18,2],[18,10,18,11],[4,1,4,5],[0,1,0,2],[0,3,0,5],[1,1,1,2],[2,1,2,2],[2,3,2,5]]}
[]
[]
[]
[]
[]
[]
[]
[]
[null,"Equipe C",null,null,null,null,null,null,null,null,"Equipe E"]
[]
[]
[null,null,null,null,null,null,null,null,null,null,null,null,null,null,null,null,null,null,null,null,null,null,"Résultats","V","D","N"]
[null,null,null,null,null,null,null,null,null,null,null,null,null,null,null,null,null,null,null,null,null,null,"C",{"$f":"IF(F21>H21,1,0)","v":0},{"$f":"IF(F21<H21,1,0)","v":0},{"$f":"IF(F21=H21,1,0)","v":1}]
[null,null,null,null,null,null,null,null,null,null,null,null,null,null,null,null,null,null,null,null,null,null,"E",{"$f":"IF(H21>F21,1,0)","v":0},{"$f":"IF(H21<F21,1,0)","v":0},{"$f":"IF(F21=H21,1,0)","v":1}]
[]
[]
[]
[]
[null,"Zone 1",null,null,null,null,null,null,null,null,"Zone 1"]
[null,"Zone 2",null,null,null,"Score",null,null,null,null,"Zone 2"]
[null,"Zone 3",null,null,null,{"$f":"(D19*Explications!W32)+(D20*Explications!X32)+(D21*Explications!Y32)+(D22*Explications!Z32)+(D23*Explications!AA32)","v":0},"VS",{"$f":"(M19*Explications!W32)+(M20*Explications!X32)+(M21*Explications!Y32)+(M22*Explications!Z32)+(M23*Explications!AA32)","v":0},null,null,"Zone 3"]
[null,"Zone 4",null,null,null,null,null,null,null,null,"Zone 4"]
[null,"Point marqué",null,null,null,null,null,null,null,null,"Point marqué"]

{"sheet":"Equipe CvsF","index":13,"n_rows":23,"n_cols":26,"rows_kept":23,"cut":false,"hidden":false,"merged":[[22,1,22,2],[22,10,22,11],[19,1,19,2],[19,5,19,7],[19,10,19,11],[20,1,20,2],[20,5,22,5],[20,6,22,6],[20,7,22,7],[20,10,20,11],[21,1,21,2],[21,10,21,11],[8,1,10,3],[8,10,10,12],[13,1,13,6],[14,2,14,6],[18,1,18,2],[18,10,18,11],[4,1,4,5],[0,1,0,2],[0,3,0,5],[1,1,1,2],[2,1,2,2],[2,3,2,5]]}
[]
[]
[]
[]
[]
[]
[]
[]
[null,"Equipe C",null,null,null,null,null,null,null,null,"Equipe F"]
[]
[]
[null,null,null,null,null,null,null,null,null,null,null,null,null,null,null,null,null,null,null,null,null,null,"Résultats","V","D","N"]
[null,null,null,null,null,null,null,null,null,null,null,null,null,null,null,null,null,null,null,null,null,null,"C",{"$f":"IF(F21>H21,1,0)","v":0},{"$f":"IF(F21<H21,1,0)","v":0},{"$f":"IF(F21=H21,1,0)","v":1}]
[null,null,null,null,null,null,null,null,null,null,null,null,null,null,null,null,null,null,null,null,null,null,"F",{"$f":"IF(H21>F21,1,0)","v":0},{"$f":"IF(H21<F21,1,0)","v":0},{"$f":"IF(F21=H21,1,0)","v":1}]
[]
[]
[]
[]
[null,"Zone 1",null,null,null,null,null,null,null,null,"Zone 1"]
[null,"Zone 2",null,null,null,"Score",null,null,null,null,"Zone 2"]
[null,"Zone 3",null,null,null,{"$f":"(D19*Explications!W32)+(D20*Explications!X32)+(D21*Explications!Y32)+(D22*Explications!Z32)+(D23*Explications!AA32)","v":0},"VS",{"$f":"(M19*Explications!W32)+(M20*Explications!X32)+(M21*Explications!Y32)+(M22*Explications!Z32)+(M23*Explications!AA32)","v":0},null,null,"Zone 3"]
[null,"Zone 4",null,null,null,null,null,null,null,null,"Zone 4"]
[null,"Point marqué",null,null,null,null,null,null,null,null,"Point marqué"]

{"sheet":"Equipe DvsE","index":14,"n_rows":23,"n_cols":26,"rows_kept":23,"cut":false,"hidden":false,"merged":[[22,1,22,2],[22,10,22,11],[19,1,19,2],[19,5,19,7],[19,10,19,11],[20,1,20,2],[20,5,22,5],[20,6,22,6],[20,7,22,7],[20,10,20,11],[21,1,21,2],[21,10,21,11],[8,1,10,3],[8,10,10,12],[13,1,13,6],[14,2,14,6],[18,1,18,2],[18,10,18,11],[4,1,4,5],[0,1,0,2],[0,3,0,5],[1,1,1,2],[2,1,2,2],[2,3,2,5]]}
[]
[]
[]
[]
[]
[]
[]
[]
[null,"Equipe D",null,null,null,null,null,null,null,null,"Equipe E"]
[]
[]
[null,null,null,null,null,null,null,null,null,null,null,null,null,null,null,null,null,null,null,null,null,null,"Résultats","V","D","N"]
[null,null,null,null,null,null,null,null,null,null,null,null,null,null,null,null,null,null,null,null,null,null,"D",{"$f":"IF(F21>H21,1,0)","v":0},{"$f":"IF(F21<H21,1,0)","v":0},{"$f":"IF(F21=H21,1,0)","v":1}]
[null,null,null,null,null,null,null,null,null,null,null,null,null,null,null,null,null,null,null,null,null,null,"E",{"$f":"IF(H21>F21,1,0)","v":0},{"$f":"IF(H21<F21,1,0)","v":0},{"$f":"IF(F21=H21,1,0)","v":1}]
[]
[]
[]
[]
[null,"Zone 1",null,null,null,null,null,null,null,null,"Zone 1"]
[null,"Zone 2",null,null,null,"Score",null,null,null,null,"Zone 2"]
[null,"Zone 3",null,null,null,{"$f":"(D19*Explications!W32)+(D20*Explications!X32)+(D21*Explications!Y32)+(D22*Explications!Z32)+(D23*Explications!AA32)","v":0},"VS",{"$f":"(M19*Explications!W32)+(M20*Explications!X32)+(M21*Explications!Y32)+(M22*Explications!Z32)+(M23*Explications!AA32)","v":0},null,null,"Zone 3"]
[null,"Zone 4",null,null,null,null,null,null,null,null,"Zone 4"]
[null,"Point marqué",null,null,null,null,null,null,null,null,"Point marqué"]

{"sheet":"Equipe DvsF","index":15,"n_rows":23,"n_cols":26,"rows_kept":23,"cut":false,"hidden":false,"merged":[[22,1,22,2],[22,10,22,11],[19,1,19,2],[19,5,19,7],[19,10,19,11],[20,1,20,2],[20,5,22,5],[20,6,22,6],[20,7,22,7],[20,10,20,11],[21,1,21,2],[21,10,21,11],[8,1,10,3],[8,10,10,12],[13,1,13,6],[14,2,14,6],[18,1,18,2],[18,10,18,11],[4,1,4,5],[0,1,0,2],[0,3,0,5],[1,1,1,2],[2,1,2,2],[2,3,2,5]]}
[]
[]
[]
[]
[]
[]
[]
[]
[null,"Equipe D",null,null,null,null,null,null,null,null,"Equipe F"]
[]
[]
[null,null,null,null,null,null,null,null,null,null,null,null,null,null,null,null,null,null,null,null,null,null,"Résultats","V","D","N"]
[null,null,null,null,null,null,null,null,null,null,null,null,null,null,null,null,null,null,null,null,null,null,"D",{"$f":"IF(F21>H21,1,0)","v":0},{"$f":"IF(F21<H21,1,0)","v":0},{"$f":"IF(F21=H21,1,0)","v":1}]
[null,null,null,null,null,null,null,null,null,null,null,null,null,null,null,null,null,null,null,null,null,null,"F",{"$f":"IF(H21>F21,1,0)","v":0},{"$f":"IF(H21<F21,1,0)","v":0},{"$f":"IF(F21=H21,1,0)","v":1}]
[]
[]
[]
[]
[null,"Zone 1",null,null,null,null,null,null,null,null,"Zone 1"]
[null,"Zone 2",null,null,null,"Score",null,null,null,null,"Zone 2"]
[null,"Zone 3",null,null,null,{"$f":"(D19*Explications!W32)+(D20*Explications!X32)+(D21*Explications!Y32)+(D22*Explications!Z32)+(D23*Explications!AA32)","v":0},"VS",{"$f":"(M19*Explications!W32)+(M20*Explications!X32)+(M21*Explications!Y32)+(M22*Explications!Z32)+(M23*Explications!AA32)","v":0},null,null,"Zone 3"]
[null,"Zone 4",null,null,null,null,null,null,null,null,"Zone 4"]
[null,"Point marqué",null,null,null,null,null,null,null,null,"Point marqué"]

{"sheet":"Equipe EvsF","index":16,"n_rows":23,"n_cols":26,"rows_kept":23,"cut":false,"hidden":false,"merged":[[22,1,22,2],[22,10,22,11],[19,1,19,2],[19,5,19,7],[19,10,19,11],[20,1,20,2],[20,5,22,5],[20,6,22,6],[20,7,22,7],[20,10,20,11],[21,1,21,2],[21,10,21,11],[8,1,10,3],[8,10,10,12],[13,1,13,6],[14,2,14,6],[18,1,18,2],[18,10,18,11],[4,1,4,5],[0,1,0,2],[0,3,0,5],[1,1,1,2],[2,1,2,2],[2,3,2,5]]}
[]
[]
[]
[]
[]
[]
[]
[]
[null,"Equipe E",null,null,null,null,null,null,null,null,"Equipe F"]
[]
[]
[null,null,null,null,null,null,null,null,null,null,null,null,null,null,null,null,null,null,null,null,null,null,"Résultats","V","D","N"]
[null,null,null,null,null,null,null,null,null,null,null,null,null,null,null,null,null,null,null,null,null,null,"E",{"$f":"IF(F21>H21,1,0)","v":0},{"$f":"IF(F21<H21,1,0)","v":0},{"$f":"IF(F21=H21,1,0)","v":1}]
[null,null,null,null,null,null,null,null,null,null,null,null,null,null,null,null,null,null,null,null,null,null,"F",{"$f":"IF(H21>F21,1,0)","v":0},{"$f":"IF(H21<F21,1,0)","v":0},{"$f":"IF(F21=H21,1,0)","v":1}]
[]
[]
[]
[]
[null,"Zone 1",null,null,null,null,null,null,null,null,"Zone 1"]
[null,"Zone 2",null,null,null,"Score",null,null,null,null,"Zone 2"]
[null,"Zone 3",null,null,null,{"$f":"(D19*Explications!W32)+(D20*Explications!X32)+(D21*Explications!Y32)+(D22*Explications!Z32)+(D23*Explications!AA32)","v":0},"VS",{"$f":"(M19*Explications!W32)+(M20*Explications!X32)+(M21*Explications!Y32)+(M22*Explications!Z32)+(M23*Explications!AA32)","v":0},null,null,"Zone 3"]
[null,"Zone 4",null,null,null,null,null,null,null,null,"Zone 4"]
[null,"Point marqué",null,null,null,null,null,null,null,null,"Point marqué"]

{"sheet":"Résultats EA","index":17,"n_rows":47,"n_cols":8,"rows_kept":47,"cut":false,"hidden":false,"merged":[[30,2,31,2],[30,3,31,3],[30,4,31,4],[30,5,31,5],[30,6,31,6],[44,7,45,7],[10,2,11,2],[10,3,11,3],[10,4,11,4],[10,5,11,5],[10,6,11,6],[16,2,17,2],[16,3,17,3],[16,4,17,4],[16,5,17,5],[44,6,45,6],[26,7,26,9],[29,1,29,6],[30,1,31,1],[36,1,36,6],[37,1,38,1],[44,1,45,1],[44,2,45,2],[44,3,45,3],[44,4,45,4],[44,5,45,5],[43,1,43,7],[37,2,38,2],[37,3,38,3],[37,4,38,4],[37,5,38,5],[37,6,38,6],[10,1,11,1],[15,1,15,6],[16,1,17,1],[22,1,22,6],[23,1,24,1],[23,5,24,5],[23,6,24,6],[23,7,25,9],[16,6,17,6],[23,2,24,2],[23,3,24,3],[23,4,24,4],[9,1,9,6],[0,1,0,2],[0,3,0,5],[1,1,1,2],[1,3,1,5],[2,1,2,5]]}
[]
[]
[]
[]
[]
[]
[]
[]
[]
[null,"AvsB"]
[null,"Total","Zone 1","Zone 2","Zone 3","Zone 4","Point"]
[]
[null,{"$f":"Explications!$W$32*C13+Explications!$X$32*D13+Explications!$Y$32*E13+Explications!$Z$32*F13+Explications!$AA$32*G13","v":0},{"$f":"'Equipe AvsB'!D19","v":0},{"$f":"'Equipe AvsB'!D20","v":0},{"$f":"'Equipe AvsB'!D21","v":0},{"$f":"'Equipe AvsB'!D22","v":0},{"$f":"'Equipe AvsB'!D23","v":0}]
[]
[]
[null,"AvsC"]
[null,"Total","Zone 1","Zone 2","Zone 3","Zone 4","Point"]
[]
[null,{"$f":"Explications!$W$32*C19+Explications!$X$32*D19+Explications!$Y$32*E19+Explications!$Z$32*F19+Explications!$AA$32*G19","v":0},{"$f":"'Equipe AvsC'!$D$19","v":0},{"$f":"'Equipe AvsC'!$D20","v":0},{"$f":"'Equipe AvsC'!$D$21","v":0},{"$f":"'Equipe AvsC'!$D$22","v":0},{"$f":"'Equipe AvsC'!$D$23","v":0}]
[]
[]
[]
[null,"AvsD"]
[null,"Total","Zone 1","Zone 2","Zone 3","Zone 4","Point"]
[]
[null,{"$f":"Explications!$W$32*C26+Explications!$X$32*D26+Explications!$Y$32*E26+Explications!$Z$32*F26+Explications!$AA$32*G26","v":0},{"$f":"'Equipe AvsD'!$D$19","v":0},{"$f":"'Equipe AvsD'!$D$20","v":0},{"$f":"'Equipe AvsD'!$D$21","v":0},{"$f":"'Equipe AvsD'!$D$22","v":0},{"$f":"'Equipe AvsD'!$D$23","v":0}]
[]
[]
[]
[null,"AvsE"]
[null,"Total","Zone 1","Zone 2","Zone 3","Zone 4","Point"]
[]
[null,{"$f":"Explications!$W$32*C33+Explications!$X$32*D33+Explications!$Y$32*E33+Explications!$Z$32*F33+Explications!$AA$32*G33","v":0},{"$f":"'Equipe AvsE'!$D$19","v":0},{"$f":"'Equipe AvsE'!$D$20","v":0},{"$f":"'Equipe AvsE'!$D$21","v":0},{"$f":"'Equipe AvsE'!$D$22","v":0},{"$f":"'Equipe AvsE'!$D$23","v":0}]
[]
[]
[]
[null,"AvsF"]
[null,"Total","Zone 1","Zone 2","Zone 3","Zone 4","Point"]
[]
[null,{"$f":"Explications!$W$32*C40+Explications!$X$32*D40+Explications!$Y$32*E40+Explications!$Z$32*F40+Explications!$AA$32*G40","v":0},{"$f":"'Equipe AvsF'!$D$19","v":0},{"$f":"'Equipe AvsF'!$D$20","v":0},{"$f":"'Equipe AvsF'!$D$21","v":0},{"$f":"'Equipe AvsF'!$D$22","v":0},{"$f":"'Equipe AvsF'!$D$23","v":0}]
[]
[]
[]
[null,"Bilan"]
[null,"Total","Match 1","Match 2","Match 3","Match 4","Match 5","Objectif atteint?"]
[]
[null,{"$f":"SUM(C47:G47)","v":0},{"$f":"B$13","v":0},{"$f":"B$19","v":0},{"$f":"B$26","v":0},{"$f":"B$33","v":0},{"$f":"B$40","v":0},{"$f":"IF(B47>=100, \"oui\", \"non\")","v":"non"}]

{"sheet":"Résultats EB","index":18,"n_rows":48,"n_cols":8,"rows_kept":48,"cut":false,"hidden":false,"merged":[[30,2,31,2],[30,3,31,3],[30,4,31,4],[30,5,31,5],[30,6,31,6],[45,7,46,7],[10,2,11,2],[10,3,11,3],[10,4,11,4],[10,5,11,5],[10,6,11,6],[16,2,17,2],[16,3,17,3],[16,4,17,4],[16,5,17,5],[45,6,46,6],[26,7,26,9],[29,1,29,6],[30,1,31,1],[36,1,36,6],[37,1,38,1],[45,1,46,1],[45,2,46,2],[45,3,46,3],[45,4,46,4],[45,5,46,5],[44,1,44,7],[37,2,38,2],[37,3,38,3],[37,4,38,4],[37,5,38,5],[37,6,38,6],[10,1,11,1],[15,1,15,6],[16,1,17,1],[22,1,22,6],[23,1,24,1],[23,5,24,5],[23,6,24,6],[23,7,25,9],[16,6,17,6],[23,2,24,2],[23,3,24,3],[23,4,24,4],[9,1,9,6],[0,1,0,2],[0,3,0,5],[1,1,1,2],[1,3,1,5],[2,1,2,5]]}
[]
[]
[]
[]
[]
[]
[]
[]
[]
[null,"BvsA"]
[null,"Total","Zone 1","Zone 2","Zone 3","Zone 4","Point"]
[]
[null,{"$f":"Explications!$W$32*C13+Explications!$X$32*D13+Explications!$Y$32*E13+Explications!$Z$32*F13+Explications!$AA$32*G13","v":0},{"$f":"'Equipe AvsB'!$M$19","v":0},{"$f":"'Equipe AvsB'!$M$20","v":0},{"$f":"'Equipe AvsB'!$M$21","v":0},{"$f":"'Equipe AvsB'!$M$22","v":0},{"$f":"'Equipe AvsB'!$M$23","v":0}]
[]
[]
[null,"BvsC"]
[null,"Total","Zone 1","Zone 2","Zone 3","Zone 4","Point"]
[]
[null,{"$f":"Explications!$W$32*C19+Explications!$X$32*D19+Explications!$Y$32*E19+Explications!$Z$32*F19+Explications!$AA$32*G19","v":0},{"$f":"'Equipe BvsC'!$D$19","v":0},{"$f":"'Equipe BvsC'!$D20","v":0},{"$f":"'Equipe BvsC'!$D$21","v":0},{"$f":"'Equipe BvsC'!$D$22","v":0},{"$f":"'Equipe BvsC'!$D$23","v":0}]
[]
[]
[]
[null,"BvsD"]
[null,"Total","Zone 1","Zone 2","Zone 3","Zone 4","Point"]
[]
[null,{"$f":"Explications!$W$32*C26+Explications!$X$32*D26+Explications!$Y$32*E26+Explications!$Z$32*F26+Explications!$AA$32*G26","v":0},{"$f":"'Equipe BvsD'!$D$19","v":0},{"$f":"'Equipe BvsD'!$D$20","v":0},{"$f":"'Equipe BvsD'!$D$21","v":0},{"$f":"'Equipe BvsD'!$D$22","v":0},{"$f":"'Equipe BvsD'!$D$23","v":0}]
[]
[]
[]
[null,"BvsE"]
[null,"Total","Zone 1","Zone 2","Zone 3","Zone 4","Point"]
[]
[null,{"$f":"Explications!$W$32*C33+Explications!$X$32*D33+Explications!$Y$32*E33+Explications!$Z$32*F33+Explications!$AA$32*G33","v":0},{"$f":"'Equipe BvsE'!$D$19","v":0},{"$f":"'Equipe BvsE'!$D$20","v":0},{"$f":"'Equipe BvsE'!$D$21","v":0},{"$f":"'Equipe BvsE'!$D$22","v":0},{"$f":"'Equipe BvsE'!$D$23","v":0}]
[]
[]
[]
[null,"BvsF"]
[null,"Total","Zone 1","Zone 2","Zone 3","Zone 4","Point"]
[]
[null,{"$f":"Explications!$W$32*C40+Explications!$X$32*D40+Explications!$Y$32*E40+Explications!$Z$32*F40+Explications!$AA$32*G40","v":0},{"$f":"'Equipe BvsF'!$D$19","v":0},{"$f":"'Equipe BvsF'!$D$20","v":0},{"$f":"'Equipe BvsF'!$D$21","v":0},{"$f":"'Equipe BvsF'!$D$22","v":0},{"$f":"'Equipe BvsF'!$D$23","v":0}]
[]
[]
[]
[]
[null,"Bilan"]
[null,"Total","Match 1","Match 2","Match 3","Match 4","Match 5","Objectif atteint?"]
[]
[null,{"$f":"SUM(C48:G48)","v":0},{"$f":"B$13","v":0},{"$f":"B$19","v":0},{"$f":"B$26","v":0},{"$f":"B$33","v":0},{"$f":"B$40","v":0},{"$f":"IF(B48>=100, \"oui\", \"non\")","v":"non"}]

{"sheet":"Résultats EC","index":19,"n_rows":49,"n_cols":8,"rows_kept":49,"cut":false,"hidden":false,"merged":[[30,2,31,2],[30,3,31,3],[30,4,31,4],[30,5,31,5],[30,6,31,6],[46,7,47,7],[10,2,11,2],[10,3,11,3],[10,4,11,4],[10,5,11,5],[10,6,11,6],[16,2,17,2],[16,3,17,3],[16,4,17,4],[16,5,17,5],[46,6,47,6],[26,7,26,9],[29,1,29,6],[30,1,31,1],[36,1,36,6],[37,1,38,1],[46,1,47,1],[46,2,47,2],[46,3,47,3],[46,4,47,4],[46,5,47,5],[45,1,45,7],[37,2,38,2],[37,3,38,3],[37,4,38,4],[37,5,38,5],[37,6,38,6],[10,1,11,1],[15,1,15,6],[16,1,17,1],[22,1,22,6],[23,1,24,1],[23,5,24,5],[23,6,24,6],[23,7,25,9],[16,6,17,6],[23,2,24,2],[23,3,24,3],[23,4,24,4],[9,1,9,6],[0,1,0,2],[0,3,0,5],[1,1,1,2],[1,3,1,5],[2,1,2,5]]}
[]
[]
[]
[]
[]
[]
[]
[]
[]
[null,"CvsA"]
[null,"Total","Zone 1","Zone 2","Zone 3","Zone 4","Point"]
[]
[null,{"$f":"Explications!$W$32*C13+Explications!$X$32*D13+Explications!$Y$32*E13+Explications!$Z$32*F13+Explications!$AA$32*G13","v":0},{"$f":"'Equipe AvsC'!$M$19","v":0},{"$f":"'Equipe AvsC'!$M$20","v":0},{"$f":"'Equipe AvsC'!$M$21","v":0},{"$f":"'Equipe AvsC'!$M$22","v":0},{"$f":"'Equipe AvsC'!$M$23","v":0}]
[]
[]
[null,"CvsB"]
[null,"Total","Zone 1","Zone 2","Zone 3","Zone 4","Point"]
[]
[null,{"$f":"Explications!$W$32*C19+Explications!$X$32*D19+Explications!$Y$32*E19+Explications!$Z$32*F19+Explications!$AA$32*G19","v":0},{"$f":"'Equipe BvsC'!$M$19","v":0},{"$f":"'Equipe BvsC'!$M$20","v":0},{"$f":"'Equipe BvsC'!$M$21","v":0},{"$f":"'Equipe BvsC'!$M$22","v":0},{"$f":"'Equipe BvsC'!$M$23","v":0}]
[]
[]
[]
[null,"CvsD"]
[null,"Total","Zone 1","Zone 2","Zone 3","Zone 4","Point"]
[]
[null,{"$f":"Explications!$W$32*C26+Explications!$X$32*D26+Explications!$Y$32*E26+Explications!$Z$32*F26+Explications!$AA$32*G26","v":0},{"$f":"'Equipe CvsD'!$D$19","v":0},{"$f":"'Equipe CvsD'!$D$20","v":0},{"$f":"'Equipe CvsD'!$D$21","v":0},{"$f":"'Equipe CvsD'!$D$22","v":0},{"$f":"'Equipe CvsD'!$D$23","v":0}]
[]
[]
[]
[null,"CvsE"]
[null,"Total","Zone 1","Zone 2","Zone 3","Zone 4","Point"]
[]
[null,{"$f":"Explications!$W$32*C33+Explications!$X$32*D33+Explications!$Y$32*E33+Explications!$Z$32*F33+Explications!$AA$32*G33","v":0},{"$f":"'Equipe CvsE'!$D$19","v":0},{"$f":"'Equipe CvsE'!$D$20","v":0},{"$f":"'Equipe CvsE'!$D$21","v":0},{"$f":"'Equipe CvsE'!$D$22","v":0},{"$f":"'Equipe CvsE'!$D$23","v":0}]
[]
[]
[]
[null,"CvsF"]
[null,"Total","Zone 1","Zone 2","Zone 3","Zone 4","Point"]
[]
[null,{"$f":"Explications!$W$32*C40+Explications!$X$32*D40+Explications!$Y$32*E40+Explications!$Z$32*F40+Explications!$AA$32*G40","v":0},{"$f":"'Equipe CvsF'!$D$19","v":0},{"$f":"'Equipe CvsF'!$D$20","v":0},{"$f":"'Equipe CvsF'!$D$21","v":0},{"$f":"'Equipe CvsF'!$D$22","v":0},{"$f":"'Equipe CvsF'!$D$23","v":0}]
[]
[]
[]
[]
[]
[null,"Bilan"]
[null,"Total","Match 1","Match 2","Match 3","Match 4","Match 5","Objectif atteint?"]
[]
[null,{"$f":"SUM(C49:G49)","v":0},{"$f":"B$13","v":0},{"$f":"B$19","v":0},{"$f":"B$26","v":0},{"$f":"B$33","v":0},{"$f":"B$40","v":0},{"$f":"IF(B49>=100, \"oui\", \"non\")","v":"non"}]

{"sheet":"Résultats ED","index":20,"n_rows":53,"n_cols":8,"rows_kept":53,"cut":false,"hidden":false,"merged":[[50,7,51,7],[37,2,38,2],[37,3,38,3],[37,4,38,4],[37,5,38,5],[37,6,38,6],[50,6,51,6],[49,1,49,7],[50,1,51,1],[50,2,51,2],[50,3,51,3],[50,4,51,4],[50,5,51,5],[26,7,26,9],[29,1,29,6],[30,1,31,1],[36,1,36,6],[37,1,38,1],[30,2,31,2],[30,3,31,3],[30,4,31,4],[30,5,31,5],[30,6,31,6],[10,1,11,1],[15,1,15,6],[16,1,17,1],[22,1,22,6],[23,1,24,1],[23,2,24,2],[23,3,24,3],[23,4,24,4],[23,5,24,5],[23,6,24,6],[16,6,17,6],[10,2,11,2],[10,3,11,3],[10,4,11,4],[10,5,11,5],[10,6,11,6],[23,7,25,9],[16,2,17,2],[16,3,17,3],[16,4,17,4],[16,5,17,5],[9,1,9,6],[0,1,0,2],[0,3,0,5],[1,1,1,2],[1,3,1,5],[2,1,2,5]]}
[]
[]
[]
[]
[]
[]
[]
[]
[]
[null,"DvsA"]
[null,"Total","Zone 1","Zone 2","Zone 3","Zone 4","Point"]
[]
[null,{"$f":"Explications!$W$32*C13+Explications!$X$32*D13+Explications!$Y$32*E13+Explications!$Z$32*F13+Explications!$AA$32*G13","v":0},{"$f":"'[1]Equipe AvsD'!$M$19","v":0},{"$f":"'[1]Equipe AvsD'!$M$20","v":0},{"$f":"'[1]Equipe AvsD'!$M$21","v":0},{"$f":"'[1]Equipe AvsD'!$M$22","v":0},{"$f":"'Equipe AvsD'!$M$23","v":0}]
[]
[]
[null,"DvsB"]
[null,"Total","Zone 1","Zone 2","Zone 3","Zone 4","Point"]
[]
[null,{"$f":"Explications!$W$32*C19+Explications!$X$32*D19+Explications!$Y$32*E19+Explications!$Z$32*F19+Explications!$AA$32*G19","v":0},{"$f":"'Equipe BvsD'!$M$19","v":0},{"$f":"'Equipe BvsD'!$M$20","v":0},{"$f":"'Equipe BvsD'!$M$21","v":0},{"$f":"'Equipe BvsD'!$M$22","v":0},{"$f":"'Equipe BvsD'!$M$23","v":0}]
[]
[]
[]
[null,"DvsC"]
[null,"Total","Zone 1","Zone 2","Zone 3","Zone 4","Point"]
[]
[null,{"$f":"Explications!$W$32*C26+Explications!$X$32*D26+Explications!$Y$32*E26+Explications!$Z$32*F26+Explications!$AA$32*G26","v":0},{"$f":"'Equipe CvsD'!$M$19","v":0},{"$f":"'Equipe CvsD'!$M$20","v":0},{"$f":"'Equipe CvsD'!$M$21","v":0},{"$f":"'Equipe CvsD'!$M$22","v":0},{"$f":"'Equipe CvsD'!$M$23","v":0}]
[]
[]
[]
[null,"DvsE"]
[null,"Total","Zone 1","Zone 2","Zone 3","Zone 4","Point"]
[]
[null,{"$f":"Explications!$W$32*C33+Explications!$X$32*D33+Explications!$Y$32*E33+Explications!$Z$32*F33+Explications!$AA$32*G33","v":0},{"$f":"'Equipe DvsE'!$D$19","v":0},{"$f":"'Equipe DvsE'!$D$20","v":0},{"$f":"'Equipe DvsE'!$D$21","v":0},{"$f":"'Equipe DvsE'!$D$22","v":0},{"$f":"'Equipe DvsE'!$D$23","v":0}]
[]
[]
[]
[null,"DvsF"]
[null,"Total","Zone 1","Zone 2","Zone 3","Zone 4","Point"]
[]
[null,{"$f":"Explications!$W$32*C40+Explications!$X$32*D40+Explications!$Y$32*E40+Explications!$Z$32*F40+Explications!$AA$32*G40","v":0},{"$f":"'Equipe DvsF'!$D$19","v":0},{"$f":"'Equipe DvsF'!$D$20","v":0},{"$f":"'Equipe DvsF'!$D$21","v":0},{"$f":"'Equipe DvsF'!$D$22","v":0},{"$f":"'Equipe DvsF'!$D$23","v":0}]
[]
[]
[]
[]
[]
[]
[]
[]
[]
[null,"Bilan"]
[null,"Total","Match 1","Match 2","Match 3","Match 4","Match 5","Objectif atteint?"]
[]
[null,{"$f":"SUM(C53:G53)","v":0},{"$f":"B13","v":0},{"$f":"B19","v":0},{"$f":"B26","v":0},{"$f":"B33","v":0},{"$f":"B40","v":0},{"$f":"IF(B53>=100, \"oui\", \"non\")","v":"non"}]

{"sheet":"Résultats EE","index":21,"n_rows":50,"n_cols":8,"rows_kept":50,"cut":false,"hidden":false,"merged":[[47,7,48,7],[37,2,38,2],[37,3,38,3],[37,4,38,4],[37,5,38,5],[37,6,38,6],[47,6,48,6],[46,1,46,7],[47,1,48,1],[47,2,48,2],[47,3,48,3],[47,4,48,4],[47,5,48,5],[26,7,26,9],[29,1,29,6],[30,1,31,1],[36,1,36,6],[37,1,38,1],[30,2,31,2],[30,3,31,3],[30,4,31,4],[30,5,31,5],[30,6,31,6],[10,1,11,1],[15,1,15,6],[16,1,17,1],[22,1,22,6],[23,1,24,1],[23,2,24,2],[23,3,24,3],[23,4,24,4],[23,5,24,5],[23,6,24,6],[16,6,17,6],[10,2,11,2],[10,3,11,3],[10,4,11,4],[10,5,11,5],[10,6,11,6],[23,7,25,9],[16,2,17,2],[16,3,17,3],[16,4,17,4],[16,5,17,5],[9,1,9,6],[0,1,0,2],[0,3,0,5],[1,1,1,2],[1,3,1,5],[2,1,2,5]]}
[]
[]
[]
[]
[]
[]
[]
[]
[]
[null,"EvsA"]
[null,"Total","Zone 1","Zone 2","Zone 3","Zone 4","Point"]
[]
[null,{"$f":"Explications!$W$32*C13+Explications!$X$32*D13+Explications!$Y$32*E13+Explications!$Z$32*F13+Explications!$AA$32*G13","v":0},{"$f":"'Equipe AvsE'!$M$19","v":0},{"$f":"'Equipe AvsE'!$M$20","v":0},{"$f":"'Equipe AvsE'!$M$21","v":0},{"$f":"'Equipe AvsE'!$M$22","v":0},{"$f":"'Equipe AvsE'!$M$23","v":0}]
[]
[]
[null,"EvsB"]
[null,"Total","Zone 1","Zone 2","Zone 3","Zone 4","Point"]
[]
[null,{"$f":"Explications!$W$32*C19+Explications!$X$32*D19+Explications!$Y$32*E19+Explications!$Z$32*F19+Explications!$AA$32*G19","v":0},{"$f":"'Equipe BvsE'!$M$19","v":0},{"$f":"'Equipe BvsE'!$M$20","v":0},{"$f":"'Equipe BvsE'!$M$21","v":0},{"$f":"'Equipe BvsE'!$M$22","v":0},{"$f":"'Equipe BvsE'!$M$23","v":0}]
[]
[]
[]
[null,"EvsC"]
[null,"Total","Zone 1","Zone 2","Zone 3","Zone 4","Point"]
[]
[null,{"$f":"Explications!$W$32*C26+Explications!$X$32*D26+Explications!$Y$32*E26+Explications!$Z$32*F26+Explications!$AA$32*G26","v":0},{"$f":"'Equipe CvsE'!$M$19","v":0},{"$f":"'Equipe CvsE'!$M$20","v":0},{"$f":"'Equipe CvsE'!$M$21","v":0},{"$f":"'Equipe CvsE'!$M$22","v":0},{"$f":"'Equipe CvsE'!$M$23","v":0}]
[]
[]
[]
[null,"EvsD"]
[null,"Total","Zone 1","Zone 2","Zone 3","Zone 4","Point"]
[]
[null,{"$f":"Explications!$W$32*C33+Explications!$X$32*D33+Explications!$Y$32*E33+Explications!$Z$32*F33+Explications!$AA$32*G33","v":0},{"$f":"'Equipe DvsE'!$M$19","v":0},{"$f":"'Equipe DvsE'!$M$20","v":0},{"$f":"'Equipe DvsE'!$M$21","v":0},{"$f":"'Equipe DvsE'!$M$22","v":0},{"$f":"'Equipe DvsE'!$M$23","v":0}]
[]
[]
[]
[null,"EvsF"]
[null,"Total","Zone 1","Zone 2","Zone 3","Zone 4","Point"]
[]
[null,{"$f":"Explications!$W$32*C40+Explications!$X$32*D40+Explications!$Y$32*E40+Explications!$Z$32*F40+Explications!$AA$32*G40","v":0},{"$f":"'Equipe EvsF'!$D$19","v":0},{"$f":"'Equipe EvsF'!$D$20","v":0},{"$f":"'Equipe EvsF'!$D$21","v":0},{"$f":"'Equipe EvsF'!$D$22","v":0},{"$f":"'Equipe EvsF'!$D$23","v":0}]
[]
[]
[]
[]
[]
[]
[null,"Bilan"]
[null,"Total","Match 1","Match 2","Match 3","Match 4","Match 5","Objectif atteint?"]
[]
[null,{"$f":"SUM(C50:G50)","v":0},{"$f":"B13","v":0},{"$f":"B19","v":0},{"$f":"B26","v":0},{"$f":"B33","v":0},{"$f":"B40","v":0},{"$f":"IF(B50>=100, \"oui\", \"non\")","v":"non"}]

{"sheet":"Résultats EF","index":22,"n_rows":49,"n_cols":8,"rows_kept":49,"cut":false,"hidden":false,"merged":[[30,2,31,2],[30,3,31,3],[30,4,31,4],[30,5,31,5],[30,6,31,6],[46,7,47,7],[10,2,11,2],[10,3,11,3],[10,4,11,4],[10,5,11,5],[10,6,11,6],[16,2,17,2],[16,3,17,3],[16,4,17,4],[16,5,17,5],[46,6,47,6],[26,7,26,9],[29,1,29,6],[30,1,31,1],[36,1,36,6],[37,1,38,1],[46,1,47,1],[46,2,47,2],[46,3,47,3],[46,4,47,4],[46,5,47,5],[45,1,45,7],[37,2,38,2],[37,3,38,3],[37,4,38,4],[37,5,38,5],[37,6,38,6],[10,1,11,1],[15,1,15,6],[16,1,17,1],[22,1,22,6],[23,1,24,1],[23,5,24,5],[23,6,24,6],[23,7,25,9],[16,6,17,6],[23,2,24,2],[23,3,24,3],[23,4,24,4],[9,1,9,6],[0,1,0,2],[0,3,0,5],[1,1,1,2],[1,3,1,5],[2,1,2,5]]}
[]
[]
[]
[]
[]
[]
[]
[]
[]
[null,"FvsA"]
[null,"Total","Zone 1","Zone 2","Zone 3","Zone 4","Point"]
[]
[null,{"$f":"Explications!$W$32*C13+Explications!$X$32*D13+Explications!$Y$32*E13+Explications!$Z$32*F13+Explications!$AA$32*G133","v":0},{"$f":"'Equipe AvsF'!$M$19","v":0},{"$f":"'Equipe AvsF'!$M$20","v":0},{"$f":"'Equipe AvsF'!$M$21","v":0},{"$f":"'Equipe AvsF'!$M$22","v":0},{"$f":"'Equipe AvsF'!$M$23","v":0}]
[]
[]
[null,"FvsB"]
[null,"Total","Zone 1","Zone 2","Zone 3","Zone 4","Point"]
[]
[null,{"$f":"Explications!$W$32*C19+Explications!$X$32*D19+Explications!$Y$32*E19+Explications!$Z$32*F19+Explications!$AA$32*G19","v":0},{"$f":"'Equipe BvsF'!$M$19","v":0},{"$f":"'Equipe BvsF'!$M$20","v":0},{"$f":"'Equipe BvsF'!$M$21","v":0},{"$f":"'Equipe BvsF'!$M$22","v":0},{"$f":"'Equipe BvsF'!$M$23","v":0}]
[]
[]
[]
[null,"FvsC"]
[null,"Total","Zone 1","Zone 2","Zone 3","Zone 4","Point"]
[]
[null,{"$f":"Explications!$W$32*C26+Explications!$X$32*D26+Explications!$Y$32*E26+Explications!$Z$32*F26+Explications!$AA$32*G26","v":0},{"$f":"'Equipe CvsF'!$M$19","v":0},{"$f":"'Equipe CvsF'!$M$20","v":0},{"$f":"'Equipe CvsF'!$M$21","v":0},{"$f":"'Equipe CvsF'!$M$22","v":0},{"$f":"'Equipe CvsF'!$M$23","v":0}]
[]
[]
[]
[null,"FvsD"]
[null,"Total","Zone 1","Zone 2","Zone 3","Zone 4","Point"]
[]
[null,{"$f":"Explications!$W$32*C33+Explications!$X$32*D33+Explications!$Y$32*E33+Explications!$Z$32*F33+Explications!$AA$32*G33","v":0},{"$f":"'Equipe DvsF'!$M$19","v":0},{"$f":"'Equipe DvsF'!$M$20","v":0},{"$f":"'Equipe DvsF'!$M$21","v":0},{"$f":"'Equipe DvsF'!$M$22","v":0},{"$f":"'Equipe DvsF'!$M$23","v":0}]
[]
[]
[]
[null,"EvsF"]
[null,"Total","Zone 1","Zone 2","Zone 3","Zone 4","Point"]
[]
[null,{"$f":"Explications!$W$32*C40+Explications!$X$32*D40+Explications!$Y$32*E40+Explications!$Z$32*F40+Explications!$AA$32*G40","v":0},{"$f":"'Equipe EvsF'!$M$19","v":0},{"$f":"'Equipe EvsF'!$M$20","v":0},{"$f":"'Equipe EvsF'!$M$21","v":0},{"$f":"'Equipe EvsF'!$M$22","v":0},{"$f":"'Equipe EvsF'!$M$23","v":0}]
[]
[]
[]
[]
[]
[null,"Bilan"]
[null,"Total","Match 1","Match 2","Match 3","Match 4","Match 5","Objectif atteint?"]
[]
[null,{"$f":"SUM(C49:G49)","v":0},{"$f":"B13","v":0},{"$f":"B19","v":0},{"$f":"B26","v":0},{"$f":"B33","v":0},{"$f":"B40","v":0},{"$f":"IF(B49>=100, \"oui\", \"non\")","v":"non"}]

{"sheet":"Bilan des Matchs","index":23,"n_rows":17,"n_cols":12,"rows_kept":17,"cut":false,"hidden":false,"merged":[[36,1,36,6],[37,1,38,1],[45,1,45,7],[46,1,47,1],[46,2,47,2],[46,3,47,3],[46,4,47,4],[46,5,47,5],[46,6,47,6],[46,7,47,7],[30,1,31,1],[16,1,16,2],[16,3,16,4],[16,5,16,6],[16,7,16,8],[22,1,22,6],[23,1,24,1],[23,7,25,9],[26,7,26,9],[29,1,29,6],[16,9,16,10],[16,11,16,12],[15,1,15,2],[15,3,15,4],[15,5,15,6],[15,7,15,8],[15,9,15,10],[15,11,15,12],[14,11,14,12],[13,1,13,2],[13,3,13,4],[13,5,13,6],[13,7,13,8],[13,9,13,10],[13,11,13,12],[14,1,14,2],[14,3,14,4],[14,5,14,6],[14,7,14,8],[14,9,14,10],[12,11,12,12],[11,1,11,2],[11,3,11,4],[11,5,11,6],[11,7,11,8],[11,9,11,10],[11,11,11,12],[12,1,12,2],[12,3,12,4],[12,5,12,6],[12,7,12,8],[12,9,12,10],[10,11,10,12],[0,1,0,2],[0,3,0,5],[1,1,1,2],[1,3,1,5],[2,1,2,5],[9,1,9,12],[10,1,10,2],[10,3,10,4],[10,5,10,6],[10,7,10,8],[10,9,10,10]]}
[]
[]
[]
[]
[]
[]
[]
[]
[]
[null,"Classement des équipes"]
[null,"Equipe",null,"Victoire",null,"Match nul",null,"Défaite",null,"Total points",null,"Rang"]
[null,"Equipe F",null,{"$f":"'Equipe AvsF'!X14+'Equipe BvsF'!X14+'Equipe CvsF'!X14+'Equipe DvsF'!X14+'Equipe EvsF'!X14","v":0},null,{"$f":"'Equipe AvsF'!Z14+'Equipe BvsF'!Z14+'Equipe CvsF'!Z14+'Equipe DvsF'!Z14+'Equipe EvsF'!Z14","v":5},null,{"$f":" 'Equipe AvsF'!Y14+'Equipe BvsF'!Y14+'Equipe CvsF'!Y14+'Equipe DvsF'!Y14+'Equipe EvsF'!Y14","v":0},null,{"$f":"(D12*3)+(F12*2)+H12*1","v":10},null,1]
[null,"Equipe E",null,{"$f":"'Equipe AvsE'!X14+'Equipe BvsE'!X14+'Equipe CvsE'!X14+'Equipe DvsE'!X14+'Equipe EvsF'!X13","v":0},null,{"$f":"'Equipe AvsE'!Z14+'Equipe BvsE'!Z14+'Equipe CvsE'!Z14+'Equipe DvsE'!Z14+'Equipe EvsF'!Z13","v":5},null,{"$f":"'Equipe AvsE'!Y14+'Equipe BvsE'!Y14+'Equipe CvsE'!Y14+'Equipe DvsE'!Y14+'Equipe EvsF'!Y13","v":0},null,{"$f":"(D13*3)+(F13*2)+H13*1","v":10},null,2]
[null,"Equipe B",null,{"$f":"'Equipe AvsB'!X14+'Equipe BvsC'!X13+'Equipe BvsD'!X13+'Equipe BvsE'!X13+'Equipe BvsF'!X13","v":0},null,{"$f":"'Equipe AvsB'!Z14+'Equipe BvsC'!Z13+'Equipe BvsD'!Z13+'Equipe BvsE'!Z13+'Equipe BvsF'!Z13","v":5},null,{"$f":"'Equipe AvsB'!Y14+'Equipe BvsC'!Y13+'Equipe BvsD'!Y13+'Equipe BvsE'!Y13+'Equipe BvsF'!Y13","v":0},null,{"$f":"(D14*3)+(F14*2)+H14*1","v":10},null,3]
[null,"Equipe C",null,{"$f":"'Equipe AvsC'!X14+'Equipe BvsC'!X14+'Equipe CvsD'!X13+'Equipe CvsE'!X13+'Equipe CvsF'!X13","v":0},null,{"$f":"'Equipe AvsC'!Z14+'Equipe BvsC'!Z14+'Equipe CvsD'!Z13+'Equipe CvsE'!Z13+'Equipe CvsF'!Z13","v":5},null,{"$f":"'Equipe AvsC'!Y14+'Equipe BvsC'!Y14+'Equipe CvsD'!Y13+'Equipe CvsE'!Y13+'Equipe CvsF'!Y13","v":0},null,{"$f":"(D15*3)+(F15*2)+H15*1","v":10},null,4]
[null,"Equipe A",null,{"$f":"'Equipe AvsF'!X13+'Equipe BvsF'!X13+'Equipe CvsF'!X13+'Equipe DvsF'!X13+'Equipe EvsF'!X13","v":0},null,{"$f":" 'Equipe AvsB'!Z13+'Equipe AvsC'!Z13+'Equipe AvsD'!Z13+'Equipe AvsE'!Z13+'Equipe AvsF'!Z13","v":5},null,{"$f":"'Equipe AvsB'!Y13+'Equipe AvsC'!Y13+'Equipe AvsD'!Y13+'Equipe AvsE'!Y13+'Equipe AvsF'!Y13","v":0},null,{"$f":"(D16*3)+(F16*2)+H16*1","v":10},null,5]
[null,"Equipe D",null,{"$f":"'Equipe AvsD'!X14+'Equipe BvsD'!X14+ 'Equipe CvsD'!X14+'Equipe DvsE'!X13+'Equipe DvsF'!X13","v":0},null,{"$f":"'Equipe AvsD'!Z14+'Equipe BvsD'!Z14+ 'Equipe CvsD'!Z14+'Equipe DvsE'!Z13+'Equipe DvsF'!Z13","v":5},null,{"$f":"'Equipe AvsD'!Y14+'Equipe BvsD'!Y14+ 'Equipe CvsD'!Y14+'Equipe DvsE'!Y13+'Equipe DvsF'!Y13","v":0},null,{"$f":"(D17*3)+(F17*2)+H17*1","v":10},null,6]